BDBM89247 MLS000123919::N-(2-Methoxy-benzyl)-4-methyl-N-(4-oxo-3,4-dihydro-quinazolin-2-ylmethyl)-benzenesulfonamide::N-[(2-methoxyphenyl)methyl]-4-methyl-N-[(4-oxidanylidene-1H-quinazolin-2-yl)methyl]benzenesulfonamide::N-[(2-methoxyphenyl)methyl]-4-methyl-N-[(4-oxo-1H-quinazolin-2-yl)methyl]benzenesulfonamide::N-[(4-keto-1H-quinazolin-2-yl)methyl]-4-methyl-N-o-anisyl-benzenesulfonamide::SMR000124500::cid_3213372
SMILES COc1ccccc1CN(Cc1nc2ccccc2c(=O)[nH]1)S(=O)(=O)c1ccc(C)cc1
InChI Key InChIKey=PFMRMIMERZWHRM-UHFFFAOYSA-N
Data  2 IC50
  Tab Delimited (TSV)   2D SDfile   Computed 3D by Vconf -m prep SDfile
Find this compound or compounds like it in BindingDB:
Activity Spreadsheet -- Enzyme Inhibition Constant Data from BindingDB
Found 2 hits for monomerid = 89247
TargetProtein Wnt-3a(Mus musculus)
Burnham Center For Chemical Genomics
Curated by PubChem BioAssay
LigandPNGBDBM89247(MLS000123919 | N-(2-Methoxy-benzyl)-4-methyl-N-(4-...)
Affinity DataIC50:  3.27E+4nM
In DepthDetails PCBioAssay
TargetZinc finger protein GLI1(Mus musculus)
Burnham Center For Chemical Genomics
Curated by PubChem BioAssay
LigandPNGBDBM89247(MLS000123919 | N-(2-Methoxy-benzyl)-4-methyl-N-(4-...)
Affinity DataIC50: >2.00E+4nM. Assay description: Data Source: Sanford-Burnham Center for Chemical Genomics (SBCCG) Source Affiliation: Sanford-Burnham Medical Research Institute (SBMRI, San Diego, C...
In DepthDetails PCBioAssay