BDBM91131 MLS001160604::N-(1,1-diketothiolan-3-yl)-4-methyl-N-[(3-methyl-2-thienyl)methyl]benzamide::N-(1,1-dioxo-3-thiolanyl)-4-methyl-N-[(3-methyl-2-thiophenyl)methyl]benzamide::N-(1,1-dioxothiolan-3-yl)-4-methyl-N-[(3-methylthiophen-2-yl)methyl]benzamide::N-[1,1-bis(oxidanylidene)thiolan-3-yl]-4-methyl-N-[(3-methylthiophen-2-yl)methyl]benzamide::SMR000670323::cid_2991517
SMILES Cc1ccsc1CN(C1CCS(=O)(=O)C1)C(=O)c1ccc(C)cc1
InChI Key InChIKey=WAZPNBCOCCJEPO-UHFFFAOYSA-N
Data  1 EC50
  Tab Delimited (TSV)   2D SDfile   Computed 3D by Vconf -m prep SDfile
Find this compound or compounds like it in BindingDB:
Activity Spreadsheet -- Enzyme Inhibition Constant Data from BindingDB
Found 1 hit for monomerid = 91131
TargetCorticotropin-releasing factor-binding protein(Homo sapiens (Human))
Burnham Center For Chemical Genomics
Curated by PubChem BioAssay
LigandPNGBDBM91131(MLS001160604 | N-(1,1-diketothiolan-3-yl)-4-methyl...)
Affinity DataEC50: >5.30E+4nM. Assay description: Data Source: Sanford-Burnham Center for Chemical Genomics (SBCCG) Source Affiliation: Sanford-Burnham Medical Research Institute (SBMRI, San Diego, C...
In DepthDetails PCBioAssay