BDBM91801 CS64
SMILES Cn1c(COc2cccc3cccnc23)nnc1SCC(N)=O
InChI Key InChIKey=RUFRDGFDDCXLKA-UHFFFAOYSA-N
Data  4 Kd
  Tab Delimited (TSV)   2D SDfile   Computed 3D by Vconf -m prep SDfile
Find this compound or compounds like it in BindingDB:
Activity Spreadsheet -- Enzyme Inhibition Constant Data from BindingDB
Found 4 hits for monomerid = 91801
TargetCyclin-dependent kinase 2(Homo sapiens (Human))
Csar
LigandPNGBDBM91801(CS64)
Affinity DataKd: >1.00E+5nMpH: 7.5 T: 2°C. Assay description: OctetRed
In DepthDetails PubMed
TargetCyclin-dependent kinase 2(Homo sapiens (Human))
Csar
LigandPNGBDBM91801(CS64)
Affinity DataKd: >1.00E+5nM. Assay description: OctetRed_Method1
In DepthDetails PubMed
TargetCyclin-dependent kinase 2(Homo sapiens (Human))
Csar
LigandPNGBDBM91801(CS64)
Affinity DataKd: >1.00E+5nM. Assay description: OctetRed_Method1
In DepthDetails PubMed
TargetCyclin-A2/Cyclin-dependent kinase 2(Homo sapiens (Human))
Csar
LigandPNGBDBM91801(CS64)
Affinity DataKd: >1.00E+5nMpH: 7.5 T: 2°C. Assay description: OctetRed
In DepthDetails PubMed