BDBM91814 CS78
SMILES COc1ccc(cc1)-c1nnc(SCC(=O)Nc2c(F)cc(F)cc2Br)n1C
InChI Key InChIKey=DTVCGBAZBYVUER-UHFFFAOYSA-N
Data  4 Kd
  Tab Delimited (TSV)   2D SDfile   Computed 3D by Vconf -m prep SDfile
Find this compound or compounds like it in BindingDB:
Activity Spreadsheet -- Enzyme Inhibition Constant Data from BindingDB
Found 4 hits for monomerid = 91814
TargetCyclin-dependent kinase 2(Homo sapiens (Human))
Csar
LigandPNGBDBM91814(CS78)
Affinity DataKd: >1.00E+5nMpH: 7.5 T: 2°C. Assay description: OctetRed
In DepthDetails PubMed
TargetCyclin-dependent kinase 2(Homo sapiens (Human))
Csar
LigandPNGBDBM91814(CS78)
Affinity DataKd: >1.00E+5nM. Assay description: OctetRed_Method1
In DepthDetails PubMed
TargetCyclin-dependent kinase 2(Homo sapiens (Human))
Csar
LigandPNGBDBM91814(CS78)
Affinity DataKd: >1.00E+5nM. Assay description: OctetRed_Method1
In DepthDetails PubMed
TargetCyclin-A2/Cyclin-dependent kinase 2(Homo sapiens (Human))
Csar
LigandPNGBDBM91814(CS78)
Affinity DataKd: >1.00E+5nMpH: 7.5 T: 2°C. Assay description: OctetRed
In DepthDetails PubMed