BDBM93327 Carbamate {5,21}, 3
SMILES Cc1ccc(cc1F)S(=O)(=O)CN1C(CCC[C@@H]1C1(CC1)OC(=O)NN1CCC(CC1)N(CCO)CCO)c1cccc(F)c1
InChI Key InChIKey=JXTLLVILUBYWLA-BDCODIICSA-N
Data  1 IC50
  Tab Delimited (TSV)   2D SDfile   Computed 3D by Vconf -m prep SDfile
Find this compound or compounds like it in BindingDB:
Activity Spreadsheet -- Enzyme Inhibition Constant Data from BindingDB
Found 1 hit for monomerid = 93327
TargetAmyloid-beta precursor protein(Homo sapiens (Human))
Schering-Plough Research Institute
LigandPNGBDBM93327(Carbamate {5,21}, 3)
Affinity DataIC50:  7.20nMpH: 7.0 T: 2°C. Assay description: Inhibition assay using gamma-secretase.
In DepthDetails ArticlePubMed