BDBM93421 PHD Inhibitor, 12{1,5,3}
SMILES Cn1c2ccc(CNC(=O)[C@H](Cc3ccccc3)NC(=O)[C@H](Cc3ccccc3)NC(=O)CCN3CCOCC3)cc2c(O)c(C(=O)NCC(O)=O)c1=O
InChI Key InChIKey=YGWDELLSCZJHOC-KYJUHHDHSA-N
Data  3 IC50
  Tab Delimited (TSV)   2D SDfile   Computed 3D by Vconf -m prep SDfile
Find this compound or compounds like it in BindingDB:
Activity Spreadsheet -- Enzyme Inhibition Constant Data from BindingDB
Found 3 hits for monomerid = 93421
TargetEgl nine homolog 1(Homo sapiens (Human))
Amgen
LigandPNGBDBM93421(PHD Inhibitor, 12{1,5,3})
Affinity DataIC50:  2.92E+3nM. Assay description: PHD1,2,3 activity was measured utilizing homogeneous time-resolved fluroescence energy transfer techology by detecting the trans-4-hydroxylatio of HI...
In DepthDetails ArticlePubMed
TargetProlyl hydroxylase EGLN3(Homo sapiens (Human))
Amgen
LigandPNGBDBM93421(PHD Inhibitor, 12{1,5,3})
Affinity DataIC50:  165nM. Assay description: PHD1,2,3 activity was measured utilizing homogeneous time-resolved fluroescence energy transfer techology by detecting the trans-4-hydroxylatio of HI...
In DepthDetails ArticlePubMed
TargetProlyl hydroxylase EGLN2(Homo sapiens (Human))
Amgen
LigandPNGBDBM93421(PHD Inhibitor, 12{1,5,3})
Affinity DataIC50:  95nM. Assay description: PHD1,2,3 activity was measured utilizing homogeneous time-resolved fluroescence energy transfer techology by detecting the trans-4-hydroxylatio of HI...
In DepthDetails ArticlePubMed