BDBM9441 CHEMBL1082738::Heterodimeric Tacrine-Based Inhibitor 8g::N-4-Quinolyl-N-9-(1,2,3,4-tetrahydroacridinyl)-1,8-diaminooctane Hydrochloride Salt::N-[8-(1,2,3,4-tetrahydroacridin-9-ylamino)octyl]quinolin-4-amine trihydrochloride
SMILES C(CCCCNc1c2CCCCc2nc2ccccc12)CCCNc1ccnc2ccccc12
InChI Key InChIKey=UNVOAAWEEGAXTN-UHFFFAOYSA-N
Data  3 IC50
PDB links: 1 PDB ID matches this monomer.
  Tab Delimited (TSV)   2D SDfile   Computed 3D by Vconf -m prep SDfile
Find this compound or compounds like it in BindingDB:
Activity Spreadsheet -- Enzyme Inhibition Constant Data from BindingDB
Found 2 hits for monomerid = 9441
TargetAcetylcholinesterase(Rattus norvegicus (rat))
Hong Kong University Of Science And Technology
LigandPNGBDBM9441(CHEMBL1082738 | Heterodimeric Tacrine-Based Inhibi...)
Affinity DataIC50:  8.80nM. Assay description: The cholinesterase assays were performed using colorimetric method reported by Ellman. Enzyme activity was determined by measuring the absorbance at...
In DepthDetails ArticlePubMed
TargetCarboxylic ester hydrolase(Rattus norvegicus (rat))
Hong Kong University Of Science And Technology
LigandPNGBDBM9441(CHEMBL1082738 | Heterodimeric Tacrine-Based Inhibi...)
Affinity DataIC50:  126nM. Assay description: The cholinesterase assays were performed using colorimetric method reported by Ellman. Enzyme activity was determined by measuring the absorbance at...
In DepthDetails ArticlePubMed