BDBM95344 2-(cyclopropanecarbonylthiocarbamoylamino)benzoic acid methyl ester::2-[[[[cyclopropyl(oxo)methyl]amino]-sulfanylidenemethyl]amino]benzoic acid methyl ester::MLS000538099::SMR000160670::cid_1226721::methyl 2-(cyclopropanecarbonylcarbamothioylamino)benzoate::methyl 2-(cyclopropylcarbonylcarbamothioylamino)benzoate::methyl 2-({[(cyclopropylcarbonyl)amino]carbothioyl}amino)benzoate
SMILES COC(=O)c1ccccc1NC(=S)NC(=O)C1CC1
InChI Key InChIKey=FDKORWGFYMNBOU-UHFFFAOYSA-N
Data  1 IC50
  Tab Delimited (TSV)   2D SDfile   Computed 3D by Vconf -m prep SDfile
Find this compound or compounds like it in BindingDB:
Activity Spreadsheet -- Enzyme Inhibition Constant Data from BindingDB
Found 1 hit for monomerid = 95344
TargetMitochondrial peptide methionine sulfoxide reductase(Bos taurus)
The Scripps Research Institute Molecular Screening Center
Curated by PubChem BioAssay
LigandPNGBDBM95344(2-(cyclopropanecarbonylthiocarbamoylamino)benzoic ...)
Affinity DataIC50: >1.55E+5nM
In DepthDetails PCBioAssay