BDBM95834 MLS001143278::N-(3-bromobenzyl)-2-[(3-methylisoxazol-5-yl)methyl]-5-phenyl-pyrazole-3-carboxamide::N-[(3-bromophenyl)methyl]-2-[(3-methyl-1,2-oxazol-5-yl)methyl]-5-phenyl-pyrazole-3-carboxamide::N-[(3-bromophenyl)methyl]-2-[(3-methyl-1,2-oxazol-5-yl)methyl]-5-phenylpyrazole-3-carboxamide::N-[(3-bromophenyl)methyl]-2-[(3-methyl-5-isoxazolyl)methyl]-5-phenyl-3-pyrazolecarboxamide::SMR001196025::cid_24980542
SMILES Cc1cc(Cn2nc(cc2C(=O)NCc2cccc(Br)c2)-c2ccccc2)on1
InChI Key InChIKey=VSOVIZYOTNJSRJ-UHFFFAOYSA-N
Data  1 IC50
  Tab Delimited (TSV)   2D SDfile   Computed 3D by Vconf -m prep SDfile
Find this compound or compounds like it in BindingDB:
Activity Spreadsheet -- Enzyme Inhibition Constant Data from BindingDB
Found 1 hit for monomerid = 95834
TargetMethionine--tRNA ligase(Trypanosoma brucei brucei strain 927/4 GUTat10.1)
The Scripps Research Institute Molecular Screening Center
Curated by PubChem BioAssay
LigandPNGBDBM95834(MLS001143278 | N-(3-bromobenzyl)-2-[(3-methylisoxa...)
Affinity DataIC50:  2.08E+3nM
In DepthDetails PCBioAssay