BDBM81459 4-(2-aminopropyl)phenol;hydrobromide::CAS_103-86-6::Hydroxyamphetamine,(+/-)::NSC_3651
SMILES CC(N)Cc1ccc(O)cc1
InChI Key InChIKey=GIKNHHRFLCDOEU-UHFFFAOYSA-N
Data  2 KI  4 IC50  5 EC50
PDB links: 1 PDB ID matches this monomer.
  Tab Delimited (TSV)   2D SDfile   Computed 3D by Vconf -m prep SDfile
Find this compound or compounds like it in BindingDB:
Activity Spreadsheet -- Enzyme Inhibition Constant Data from BindingDB
Found 11 hits for monomerid = 81459
TargetAlpha-1A adrenergic receptor(Rattus norvegicus (Rat))
TBA
Curated by PDSP Ki Database
LigandPNGBDBM81459(4-(2-aminopropyl)phenol;hydrobromide | CAS_103-86-...)
Affinity DataKi:  5.00E+3nM
In DepthDetails PubMed
TargetAlpha-1A adrenergic receptor(Rattus norvegicus (Rat))
TBA
Curated by PDSP Ki Database
LigandPNGBDBM81459(4-(2-aminopropyl)phenol;hydrobromide | CAS_103-86-...)
Affinity DataKi:  3.90E+4nM
In DepthDetails PubMed
TargetTrace amine-associated receptor 1(Homo sapiens (Human))
The Scripps Research Institute Molecular Screening Center
Curated by PubChem BioAssay
LigandPNGBDBM81459(4-(2-aminopropyl)phenol;hydrobromide | CAS_103-86-...)
Affinity DataIC50:  1.18E+4nM
In DepthDetails PCBioAssay
TargetTrace amine-associated receptor 1(Rattus norvegicus (Rat))
Virginia Commonwealth University
Curated by ChEMBL
LigandPNGBDBM81459(4-(2-aminopropyl)phenol;hydrobromide | CAS_103-86-...)
Affinity DataEC50:  51nM. Assay description: Compound was evaluated for the binding affinity of Opioid receptor mu 1 by displacing the radioligand [3H]DAMGO from rat brain membrane
In DepthDetails ArticlePubMed
TargetTrace amine-associated receptor 1(Homo sapiens (Human))
The Scripps Research Institute Molecular Screening Center
Curated by PubChem BioAssay
LigandPNGBDBM81459(4-(2-aminopropyl)phenol;hydrobromide | CAS_103-86-...)
Affinity DataEC50:  1.71E+3nM
In DepthDetails PCBioAssay
TargetTrace amine-associated receptor 1(Homo sapiens (Human))
The Scripps Research Institute Molecular Screening Center
Curated by PubChem BioAssay
LigandPNGBDBM81459(4-(2-aminopropyl)phenol;hydrobromide | CAS_103-86-...)
Affinity DataEC50:  1.18E+3nM
In DepthDetails PCBioAssay
TargetGuanine nucleotide-binding protein subunit alpha-15(Homo sapiens (Human))
The Scripps Research Institute Molecular Screening Center
Curated by PubChem BioAssay
LigandPNGBDBM81459(4-(2-aminopropyl)phenol;hydrobromide | CAS_103-86-...)
Affinity DataIC50: >2.99E+4nM
In DepthDetails PCBioAssay
TargetGuanine nucleotide-binding protein subunit alpha-15(Homo sapiens (Human))
The Scripps Research Institute Molecular Screening Center
Curated by PubChem BioAssay
LigandPNGBDBM81459(4-(2-aminopropyl)phenol;hydrobromide | CAS_103-86-...)
Affinity DataIC50: >2.99E+4nM
In DepthDetails PCBioAssay
TargetGuanine nucleotide-binding protein subunit alpha-15(Homo sapiens (Human))
The Scripps Research Institute Molecular Screening Center
Curated by PubChem BioAssay
LigandPNGBDBM81459(4-(2-aminopropyl)phenol;hydrobromide | CAS_103-86-...)
Affinity DataEC50: >2.99E+4nM
In DepthDetails PCBioAssay
TargetGuanine nucleotide-binding protein subunit alpha-15(Homo sapiens (Human))
The Scripps Research Institute Molecular Screening Center
Curated by PubChem BioAssay
LigandPNGBDBM81459(4-(2-aminopropyl)phenol;hydrobromide | CAS_103-86-...)
Affinity DataEC50: >2.99E+4nM
In DepthDetails PCBioAssay
TargetTrace amine-associated receptor 1(Homo sapiens (Human))
The Scripps Research Institute Molecular Screening Center
Curated by PubChem BioAssay
LigandPNGBDBM81459(4-(2-aminopropyl)phenol;hydrobromide | CAS_103-86-...)
Affinity DataIC50:  5.84E+3nM
In DepthDetails PCBioAssay