BDBM97075 4-[1-(2,4-dichlorobenzyl)-3-phenyl-pyrazol-4-yl]-5-keto-2-methyl-4,6,7,8-tetrahydro-1H-quinoline-3-carboxylic acid methyl ester::4-[1-[(2,4-dichlorophenyl)methyl]-3-phenyl-4-pyrazolyl]-2-methyl-5-oxo-4,6,7,8-tetrahydro-1H-quinoline-3-carboxylic acid methyl ester::MLS000324781::SMR000159821::cid_3380750::methyl 4-[1-(2,4-dichlorobenzyl)-3-phenyl-1H-pyrazol-4-yl]-2-methyl-5-oxo-1,4,5,6,7,8-hexahydro-3-quinolinecarboxylate::methyl 4-[1-[(2,4-dichlorophenyl)methyl]-3-phenyl-pyrazol-4-yl]-2-methyl-5-oxidanylidene-4,6,7,8-tetrahydro-1H-quinoline-3-carboxylate::methyl 4-[1-[(2,4-dichlorophenyl)methyl]-3-phenylpyrazol-4-yl]-2-methyl-5-oxo-4,6,7,8-tetrahydro-1H-quinoline-3-carboxylate
SMILES COC(=O)C1=C(C)N=C2CCCC(=O)C2C1c1cn(Cc2ccc(Cl)cc2Cl)nc1-c1ccccc1
InChI Key InChIKey=AMFDTNFYUAMVNX-UHFFFAOYSA-N
Data  1 IC50
  Tab Delimited (TSV)   2D SDfile   Computed 3D by Vconf -m prep SDfile
Find this compound or compounds like it in BindingDB:
Activity Spreadsheet -- Enzyme Inhibition Constant Data from BindingDB
Found 1 hit for monomerid = 97075
TargetGalanin receptor type 3(Homo sapiens (Human))
The Scripps Research Institute Molecular Screening Center
Curated by PubChem BioAssay
LigandPNGBDBM97075(4-[1-(2,4-dichlorobenzyl)-3-phenyl-pyrazol-4-yl]-5...)
Affinity DataIC50:  3.85E+3nM
In DepthDetails PCBioAssay