BDBM97185 2-(2-hydroxyethoxymethyl)-N-(4-phenoxyphenyl)-1,3-thiazole-4-carboxamide::2-(2-hydroxyethoxymethyl)-N-(4-phenoxyphenyl)-4-thiazolecarboxamide::2-(2-hydroxyethoxymethyl)-N-(4-phenoxyphenyl)thiazole-4-carboxamide::2-(2-hydroxyethyloxymethyl)-N-(4-phenoxyphenyl)-1,3-thiazole-4-carboxamide::MLS003119183::SMR001272718::cid_49786188
SMILES OCCOCc1nc(cs1)C(=O)Nc1ccc(Oc2ccccc2)cc1
InChI Key InChIKey=GLBGMDYHCVIIJX-UHFFFAOYSA-N
Data  1 IC50
  Tab Delimited (TSV)   2D SDfile   Computed 3D by Vconf -m prep SDfile
Find this compound or compounds like it in BindingDB:
Activity Spreadsheet -- Enzyme Inhibition Constant Data from BindingDB
Found 1 hit for monomerid = 97185
TargetGalanin receptor type 3(Homo sapiens (Human))
The Scripps Research Institute Molecular Screening Center
Curated by PubChem BioAssay
LigandPNGBDBM97185(2-(2-hydroxyethoxymethyl)-N-(4-phenoxyphenyl)-1,3-...)
Affinity DataIC50:  1.39E+3nM
Ligand InfoPC cidPC sid
In DepthDetails PCBioAssay