BDBM97402 Orexin receptor antagonist 34::US20130102619, 34
SMILES C[C@@H]1CC[C@H](CN1C(=O)c1ccc(F)cc1-c1ncccn1)Oc1cc(ccn1)C#N
InChI Key InChIKey=DVQKBFBIBGIHAF-CRAIPNDOSA-N
Data  2 KI  2 IC50
  Tab Delimited (TSV)   2D SDfile   Computed 3D by Vconf -m prep SDfile
Find this compound or compounds like it in BindingDB:
Activity Spreadsheet -- Enzyme Inhibition Constant Data from BindingDB
Found 4 hits for monomerid = 97402
TargetOrexin receptor type 2(Homo sapiens (Human))
TBA
US Patent
LigandPNGBDBM97402(Orexin receptor antagonist 34 | US20130102619, 34)
Affinity DataKi:  3.5nM. Assay description: The inhibition constant (ki) is determined using a radioligand assay.
In DepthDetails US Patent
TargetOrexin/Hypocretin receptor type 1(Homo sapiens (Human))
TBA
US Patent
LigandPNGBDBM97402(Orexin receptor antagonist 34 | US20130102619, 34)
Affinity DataKi:  868nM. Assay description: The inhibition constant (ki) is determined using a radioligand assay.
In DepthDetails US Patent
TargetOrexin receptor type 2(Rattus norvegicus (Rat))
TBA
US Patent
LigandPNGBDBM97402(Orexin receptor antagonist 34 | US20130102619, 34)
Affinity DataIC50:  48nMT: 2°C. Assay description: FLIPR assay using orexin receptor.
In DepthDetails US Patent
TargetOrexin/Hypocretin receptor type 1(Rattus norvegicus (Rat))
TBA
US Patent
LigandPNGBDBM97402(Orexin receptor antagonist 34 | US20130102619, 34)
Affinity DataIC50: >1.00E+4nMT: 2°C. Assay description: FLIPR assay using orexin receptor.
In DepthDetails US Patent