BDBM9884 9H-fluoren-9-ylmethyl N-[(5S)-5-carbamoyl-5-[(4-methylbenzene)(2-methylpropyl)sulfonamido]pentyl]carbamate::Lysine derivative 46
SMILES CC(C)CN([C@@H](CCCCNC(=O)OCC1c2ccccc2-c2ccccc12)C(N)=O)S(=O)(=O)c1ccc(C)cc1
InChI Key InChIKey=KGJXHNNSMMCNMR-PMERELPUSA-N
Data  1 KI
  Tab Delimited (TSV)   2D SDfile   Computed 3D by Vconf -m prep SDfile
Find this compound or compounds like it in BindingDB:
Activity Spreadsheet -- Enzyme Inhibition Constant Data from BindingDB
Found 1 hit for monomerid = 9884
TargetDimer of Gag-Pol polyprotein [501-599](Human immunodeficiency virus type 1)
Pharmacor
LigandPNGBDBM9884(9H-fluoren-9-ylmethyl N-[(5S)-5-carbamoyl-5-[(4-me...)
Affinity DataKi:  107nM. Assay description: HIV-1 protease activity was measured by a continuous fluorometric assay using the internally quenched fluorogenic substrate DABCYL-Ser-Gln-Asn-Tyr-Pr...
In DepthDetails ArticlePubMed