Target
Fibroblast growth factor receptor 3
Ligand
BDBM302387
Substrate
IC50
1.80±n/a nM
Citation
 Collin, MBrohm, DHéroult, MLobell, MHübsch, WLustig, KGrünewald, SBömer, UVöhringer, VLindner, N Substituted benzothienyl-pyrrolotriazines and uses thereof in the treatment cancer US Patent  US9598416 Publication Date 3/21/2017 
Target
Name:
Fibroblast growth factor receptor 3
Synonyms:
CD_antigen: CD333 FGFR3 Fibroblast growth factor receptor JTK4
Type:
Protein
Mol. Mass.:
87699.57
Organism:
Homo sapiens (Human)
Description:
P22607
Residue:
806
  
Inhibitor
Name:
BDBM302387
Synonyms:
4-{[4-Amino-5-(5,7-dimethoxy-1-benzothiophen-2-yl)pyrrolo[2,1-f][1,2,4]triazin-6-yl]methyl}-piperazin-2-one | US9598416, Example 33
Type:
Small organic molecule
Emp. Form.:
C21H22N6O3S
Mol. Mass.:
438.503
SMILES:
COc1cc(OC)c2sc(cc2c1)-c1c(CN2CCNC(=O)C2)cn2ncnc(N)c12
: