Target
Fibroblast growth factor receptor 3
Ligand
BDBM302416
Substrate
IC50
2.60±n/a nM
Citation
 Collin, MBrohm, DHéroult, MLobell, MHübsch, WLustig, KGrünewald, SBömer, UVöhringer, VLindner, N Substituted benzothienyl-pyrrolotriazines and uses thereof in the treatment cancer US Patent  US9598416 Publication Date 3/21/2017 
Target
Name:
Fibroblast growth factor receptor 3
Synonyms:
CD_antigen: CD333 FGFR3 Fibroblast growth factor receptor JTK4
Type:
Protein
Mol. Mass.:
87699.57
Organism:
Homo sapiens (Human)
Description:
P22607
Residue:
806
  
Inhibitor
Name:
BDBM302416
Synonyms:
US9598416, Example 62
Type:
Small organic molecule
Emp. Form.:
C23H27N5O2S
Mol. Mass.:
437.558
SMILES:
COC1CCCN(Cc2cn3ncnc(N)c3c2-c2cc3cc(C)cc(OC)c3s2)C1
: