Target
Replicase polyprotein 1ab
Ligand
BDBM420298
Substrate
Meas. Tech.
SARS-CoV-2 Coronavirus 3C Protease FRET Assay
Ki
0.03±0.10 nM
Citation
 BEZAWADA, PHAWKING, ELHoffman, RLJaini, RKania, RSKulkarni, SLillis, JRLuthra, SLARAMY, MNOwen, DRPencheva, KDPettersson, MYRANE, AMSammons, MFSullivan, BPTHIEL, AJTICEHURST, MDTuttle, JB Compounds and methods for the treatment of covid-19 WIPO 0:0 (2021) Target
Name:
Replicase polyprotein 1ab
Synonyms:
ORF1ab polyprotein pp1ab | rep
Type:
Protein
Mol. Mass.:
799837.52
Organism:
BtCoV
Description:
P0C6W4
Residue:
7181
  
Inhibitor
Name:
BDBM420298
Synonyms:
CVD-0006356 PF-0835231 US11753373, Compound A-5-d WO2021205298, Compound 1 | cmdc.202100576, 6b
Type:
Small organic molecule
Emp. Form.:
C24H32N4O6
Mol. Mass.:
472.5341
SMILES:
COc1cccc2[nH]c(cc12)C(=O)N[C@@H](CC(C)C)C(=O)N[C@@H](C[C@@H]1CCNC1=O)C(=O)CO
: