Target
Replicase polyprotein 1ab
Ligand
BDBM510049
Substrate
Meas. Tech.
Protection from SARS-CoV-2 Coronavirus Infection
EC50
144±n/a nM
Citation
 BEZAWADA, PHAWKING, ELHoffman, RLJaini, RKania, RSKulkarni, SLillis, JRLuthra, SLARAMY, MNOwen, DRPencheva, KDPettersson, MYRANE, AMSammons, MFSullivan, BPTHIEL, AJTICEHURST, MDTuttle, JB Compounds and methods for the treatment of covid-19 WIPO 0:0 (2021) Target
Name:
Replicase polyprotein 1ab
Synonyms:
ORF1ab polyprotein pp1ab | rep
Type:
Protein
Mol. Mass.:
794070.71
Organism:
2019-nCoV
Description:
P0DTD1
Residue:
7096
  
Inhibitor
Name:
BDBM510049
Synonyms:
'WO2021205298, Compound 49 CVD-0016338
Type:
Small organic molecule
Emp. Form.:
C24H33N4O9P
Mol. Mass.:
552.514
SMILES:
COc1cccc2[nH]c(cc12)C(=O)N[C@@H](CC(C)C)C(=O)N[C@@H](C[C@@H]1CCNC1=O)C(=O)COP(O)(O)=O
: