Target
Cannabinoid receptor 2
Ligand
BDBM295694
Substrate
Meas. Tech.
In Vitro Assay
EC50
0.270±n/a nM
Citation
 Riether, DBinder, FPDoods, HMueller, SGNicholson, JRSauer, A (Cyano-dimethyl-methyl)-isoxazoles and -[1,3,4]thiadiazoles US Patent  US11084810 Publication Date 8/10/2021 
Target
Name:
Cannabinoid receptor 2
Synonyms:
CANNABINOID CB2 CB2 CB2B CNR2_HUMAN Cannabinoid CB2 receptor Cannabinoid receptor 2 (CB2R) | hCB2
Type:
G Protein-Coupled Receptor (GPCR)
Mol. Mass.:
39690.94
Organism:
Homo sapiens (Human)
Description:
P34972
Residue:
360
  
Inhibitor
Name:
BDBM295694
Synonyms:
Example 46 in WO2010147792 US11084810, Example 46 in WO2010147792 | US11725004, Example 46 in WO2010147792
Type:
Small organic molecule
Emp. Form.:
C19H33N3O4
Mol. Mass.:
367.483
SMILES:
COCC(C)(C)c1cc(NC(=O)C(C)(C)N(C)CC2CCOCC2)on1
: