Target
Replicase polyprotein 1ab
Ligand
BDBM50248122
Substrate
Meas. Tech.
Various Assay
IC50
4400±n/a nM
Citation
 Gao, KWang, RChen, JTepe, JJHuang, FWei, GW Perspectives on SARS-CoV-2 Main Protease Inhibitors. J Med Chem 64:16922-16955 (2021)  
Target
Name:
Replicase polyprotein 1ab
Synonyms:
ORF1ab polyprotein pp1ab | rep
Type:
Protein
Mol. Mass.:
794070.71
Organism:
2019-nCoV
Description:
P0DTD1
Residue:
7096
  
Inhibitor
Name:
BDBM50248122
Synonyms:
Bron-opol CHEBI:31306
Type:
Small organic molecule
Emp. Form.:
C3H6BrNO4
Mol. Mass.:
199.988
SMILES:
OCC(Br)(CO)[N+]([O-])=O
: