Target
Cyclin-dependent kinase 4/G1/S-specific cyclin-E1
Ligand
BDBM50464613
Substrate
Meas. Tech.
Kinase Inhibitory Activity Assay
IC50
4.46±n/a nM
Citation
 Yin, LLiu, WLi, HZhu, D Protein kinase inhibitors, preparation method and medical use thereof US Patent  US11091476 Publication Date 8/17/2021 
Target
Name:
Cyclin-dependent kinase 4/G1/S-specific cyclin-E1
Synonyms:
CDK4/E1 | Cyclin-dependent kinase 4/G1/S-specific cyclin-E1
Type:
Protein
Mol. Mass.:
Description:
Components:
This complex has 2 components.
Component 1
Name:
Cyclin-dependent kinase 4
Synonyms:
CDK4 Cell division protein kinase 4 PSK-J3
Type:
Enzyme Subunit
Mol. Mass.:
33731.96
Organism:
Homo sapiens (Human)
Description:
P11802
Residue:
303
  
Component 2
Name:
G1/S-specific cyclin-E1
Synonyms:
CCNE CCNE1_HUMAN
Type:
Enzyme Subunit
Mol. Mass.:
47073.17
Organism:
Homo sapiens (Human)
Description:
Residue:
410
  
Inhibitor
Name:
BDBM50464613
Synonyms:
CHEMBL4288165 | US11091476, Example 12
Type:
Small organic molecule
Emp. Form.:
C29H32F2N6
Mol. Mass.:
502.6014
SMILES:
CCN1CCC(CC1)c1ccc(Nc2ncc(F)c(n2)-c2cc3c(N=C(C)C33CCCC3)c(F)c2)nc1
: