Target
Orexin/Hypocretin receptor type 1
Ligand
BDBM118379
Substrate
Meas. Tech.
Human Orexin 1 Receptor Radioligand Binding Studies
Ki
8999±n/a nM
Citation
 Chai, WLetavic, MALy, KSPippel, DJRudolph, DASappey, KCSavall, BMShah, CRShireman, BTJohnson, ASStocking, EMSwanson, DM Disubstituted octahydropyrrolo[3,4-C]pyrroles as orexin receptor modulators US Patent  US11059828 Publication Date 7/13/2021 
Target
Name:
Orexin/Hypocretin receptor type 1
Synonyms:
HCRTR1 OX1R_HUMAN Orexin receptor type 1 (OR 1) Orexin receptor type 1 (OX1) Orexin receptor type 1 (OxR1) | Ox1r
Type:
Protein
Mol. Mass.:
47554.50
Organism:
Homo sapiens (Human)
Description:
O43613
Residue:
425
  
Inhibitor
Name:
BDBM118379
Synonyms:
US11059828, Example 32 US8653263, 32 USRE48841, Example 32
Type:
Small organic molecule
Emp. Form.:
C22H22N4OS
Mol. Mass.:
390.501
SMILES:
Cc1ccnc(n1)N1CC2CN(CC2C1)C(=O)c1ccccc1-c1cccs1
: