Target
Protein-tyrosine kinase 6
Ligand
BDBM514125
Substrate
Meas. Tech.
Measurement of Brk Inhibitory Activity
IC50
11.0±n/a nM
Citation
 Yamamoto, SKurono, MYoshida, AHotta, S BRK inhibitory compound US Patent  US11052091 Publication Date 7/6/2021 
Target
Name:
Protein-tyrosine kinase 6
Synonyms:
BRK KH domain-containing, RNA-binding, signal transduction-associated protein 1 PTK6_HUMAN Tyrosine Kinase BRK Tyrosine-protein kinase BRK
Type:
Tyrosine-protein kinase
Mol. Mass.:
51839.11
Organism:
Homo sapiens (Human)
Description:
Residue:
451
  
Inhibitor
Name:
BDBM514125
Synonyms:
US11052091, Example 4
Type:
Small organic molecule
Emp. Form.:
C23H21FN8O2
Mol. Mass.:
460.4636
SMILES:
CC(C)n1c2nc(Nc3ccc(cc3F)C(C)=O)nc(N)c2n(-c2cccc3[nH]ncc23)c1=O
: