Target
Protein-tyrosine kinase 6
Ligand
BDBM514127
Substrate
Meas. Tech.
Measurement of Brk Inhibitory Activity
IC50
5.00±n/a nM
Citation
 Yamamoto, SKurono, MYoshida, AHotta, S BRK inhibitory compound US Patent  US11052091 Publication Date 7/6/2021 
Target
Name:
Protein-tyrosine kinase 6
Synonyms:
BRK KH domain-containing, RNA-binding, signal transduction-associated protein 1 PTK6_HUMAN Tyrosine Kinase BRK Tyrosine-protein kinase BRK
Type:
Tyrosine-protein kinase
Mol. Mass.:
51839.11
Organism:
Homo sapiens (Human)
Description:
Residue:
451
  
Inhibitor
Name:
BDBM514127
Synonyms:
US11052091, Example 5-2
Type:
Small organic molecule
Emp. Form.:
C23H21FN8O3S
Mol. Mass.:
508.528
SMILES:
CS(=O)(=O)c1ccc(Nc2nc(N)c3n(-c4cccc5[nH]ncc45)c(=O)n(C4CCC4)c3n2)c(F)c1
: