Target
Protein-tyrosine kinase 6
Ligand
BDBM514136
Substrate
Meas. Tech.
Measurement of Brk Inhibitory Activity
IC50
3.00±n/a nM
Citation
 Yamamoto, SKurono, MYoshida, AHotta, S BRK inhibitory compound US Patent  US11052091 Publication Date 7/6/2021 
Target
Name:
Protein-tyrosine kinase 6
Synonyms:
BRK KH domain-containing, RNA-binding, signal transduction-associated protein 1 PTK6_HUMAN Tyrosine Kinase BRK Tyrosine-protein kinase BRK
Type:
Tyrosine-protein kinase
Mol. Mass.:
51839.11
Organism:
Homo sapiens (Human)
Description:
Residue:
451
  
Inhibitor
Name:
BDBM514136
Synonyms:
US11052091, Example 5-18
Type:
Small organic molecule
Emp. Form.:
C21H23N9O
Mol. Mass.:
417.467
SMILES:
CC(C)n1c2nc(Nc3cn(C)nc3C)nc(N)c2n(-c2ccc3cc[nH]c3c2)c1=O
: