Target
Protein-tyrosine kinase 6
Ligand
BDBM514138
Substrate
Meas. Tech.
Measurement of Brk Inhibitory Activity
IC50
5.00±n/a nM
Citation
 Yamamoto, SKurono, MYoshida, AHotta, S BRK inhibitory compound US Patent  US11052091 Publication Date 7/6/2021 
Target
Name:
Protein-tyrosine kinase 6
Synonyms:
BRK KH domain-containing, RNA-binding, signal transduction-associated protein 1 PTK6_HUMAN Tyrosine Kinase BRK Tyrosine-protein kinase BRK
Type:
Tyrosine-protein kinase
Mol. Mass.:
51839.11
Organism:
Homo sapiens (Human)
Description:
Residue:
451
  
Inhibitor
Name:
BDBM514138
Synonyms:
US11052091, Example 5-21
Type:
Small organic molecule
Emp. Form.:
C26H28N8O3
Mol. Mass.:
500.5523
SMILES:
COc1cc(Nc2nc(N)c3n(-c4ccc5[nH]ccc5c4)c(=O)n(C(C)C)c3n2)ccc1C(=O)N(C)C
: