Target
Histone-lysine N-methyltransferase EZH2
Ligand
BDBM172074
Substrate
Meas. Tech.
PRC2 Enzyme Assays on Peptide Substrates
IC50
3.11±n/a nM
Citation
 Kuntz, KWChesworth, RDuncan, KWKeilhack, HWarholic, NKlaus, CKnutson, SKWigle, TJSeki, MShirotori, SKawano, S Aryl-or heteroaryl-substituted benzene compounds US Patent  US11052093 Publication Date 7/6/2021 
Target
Name:
Histone-lysine N-methyltransferase EZH2
Synonyms:
ENX-1 EZH2_HUMAN Histone-lysine N-methyltransferase EZH2 Lysine N-methyltransferase 6
Type:
Protein
Mol. Mass.:
85367.84
Organism:
Homo sapiens (Human)
Description:
Q15910
Residue:
746
  
Inhibitor
Name:
BDBM172074
Synonyms:
US10155002, Compound 80 US9090562, 80
Type:
Small organic molecule
Emp. Form.:
C35H45FN4O3
Mol. Mass.:
588.7552
SMILES:
CCN(C1CCOCC1)c1cc(cc(C(=O)NCc2c(C)cc(C)[nH]c2=O)c1C)-c1ccc(CN2CCC(F)CC2)cc1
: