Target
Histone-lysine N-methyltransferase EZH2 [Y641F]
Ligand
BDBM172093
Substrate
Meas. Tech.
PRC2 Enzyme Assays on Peptide Substrates
IC50
2.56±n/a nM
Citation
 Kuntz, KWChesworth, RDuncan, KWKeilhack, HWarholic, NKlaus, CKnutson, SKWigle, TJSeki, MShirotori, SKawano, S Aryl-or heteroaryl-substituted benzene compounds US Patent  US11052093 Publication Date 7/6/2021 
Target
Name:
Histone-lysine N-methyltransferase EZH2 [Y641F]
Synonyms:
EZH2 EZH2_HUMAN KMT6
Type:
Mol. Mass.:
85351.84
Organism:
Homo sapiens (Human)
Description:
Q15910[Y641F]
Residue:
746
  
Inhibitor
Name:
BDBM172093
Synonyms:
US10155002, Compound 99 US9090562, 99
Type:
Small organic molecule
Emp. Form.:
C33H44N4O4
Mol. Mass.:
560.7269
SMILES:
CCN(C1CCOCC1)c1cc(cc(C(=O)NCc2c(C)cc(C)[nH]c2=O)c1C)-c1ccc(CNCCCO)cc1
: