Target
Histone-lysine N-methyltransferase EZH2
Ligand
BDBM172149
Substrate
Meas. Tech.
PRC2 Enzyme Assays on Peptide Substrates
IC50
3.57±n/a nM
Citation
 Kuntz, KWChesworth, RDuncan, KWKeilhack, HWarholic, NKlaus, CKnutson, SKWigle, TJSeki, MShirotori, SKawano, S Aryl-or heteroaryl-substituted benzene compounds US Patent  US11052093 Publication Date 7/6/2021 
Target
Name:
Histone-lysine N-methyltransferase EZH2
Synonyms:
ENX-1 EZH2_HUMAN Histone-lysine N-methyltransferase EZH2 Lysine N-methyltransferase 6
Type:
Protein
Mol. Mass.:
85367.84
Organism:
Homo sapiens (Human)
Description:
Q15910
Residue:
746
  
Inhibitor
Name:
BDBM172149
Synonyms:
US10155002, Compound 156 US9090562, 156
Type:
Small organic molecule
Emp. Form.:
C30H40N4O2S
Mol. Mass.:
520.729
SMILES:
CCN([C@H]1CC[C@@H](CC1)N(C)C)c1cc(cc(C(=O)NCc2c(C)cc(C)[nH]c2=O)c1C)-c1ccsc1
: