Target
Histone-lysine N-methyltransferase EZH2 [Y641F]
Ligand
BDBM172166
Substrate
Meas. Tech.
PRC2 Enzyme Assays on Peptide Substrates
IC50
2.89±n/a nM
Citation
 Kuntz, KWChesworth, RDuncan, KWKeilhack, HWarholic, NKlaus, CKnutson, SKWigle, TJSeki, MShirotori, SKawano, S Aryl-or heteroaryl-substituted benzene compounds US Patent  US11052093 Publication Date 7/6/2021 
Target
Name:
Histone-lysine N-methyltransferase EZH2 [Y641F]
Synonyms:
EZH2 EZH2_HUMAN KMT6
Type:
Mol. Mass.:
85351.84
Organism:
Homo sapiens (Human)
Description:
Q15910[Y641F]
Residue:
746
  
Inhibitor
Name:
BDBM172166
Synonyms:
EPZ008280 US11052093, Compound 174 US9175331, 28
Type:
Small organic molecule
Emp. Form.:
C30H40N6O2
Mol. Mass.:
516.6776
SMILES:
CCN([C@H]1CC[C@@H](CC1)N(C)C)c1cc(cc(C(=O)NCc2c(C)cc(C)[nH]c2=O)c1C)-c1cnccn1
: