Target
Ubiquitin carboxyl-terminal hydrolase 30
Ligand
BDBM404347
Substrate
Meas. Tech.
USP30 Biochemical Fluorescence Intensity IC50 Assay
IC50
550±n/a nM
Citation
 Jones, AKemp, MStockley, MGibson, KWhitlock, G 1-cyano-pyrrolidine compounds as USP30 inhibitors US Patent  US11053198 Publication Date 7/6/2021 
Target
Name:
Ubiquitin carboxyl-terminal hydrolase 30
Synonyms:
Deubiquitinating enzyme 30 USP30 Ubiquitin carboxyl-terminal hydrolase 30 (USP30) Ubiquitin-specific-processing protease 30
Type:
Protein
Mol. Mass.:
58522.90
Organism:
Homo sapiens (Human)
Description:
Q70CQ3
Residue:
517
  
Inhibitor
Name:
BDBM404347
Synonyms:
US10343992, Example 6 US11053198, Example 6 US11390584, Example 6
Type:
Small organic molecule
Emp. Form.:
C18H23FN4O2
Mol. Mass.:
346.3992
SMILES:
C[C@H]1CN(C[C@@H](C)O1)c1ccc(cc1F)C(=O)N[C@@H]1CCN(C1)C#N
: