Target
Ubiquitin carboxyl-terminal hydrolase 30
Ligand
BDBM447525
Substrate
Meas. Tech.
USP30 Biochemical Fluorescence Intensity IC50 Assay
IC50
550±n/a nM
Citation
 Jones, AKemp, MStockley, MGibson, KWhitlock, G 1-cyano-pyrrolidine compounds as USP30 inhibitors US Patent  US11053198 Publication Date 7/6/2021 
Target
Name:
Ubiquitin carboxyl-terminal hydrolase 30
Synonyms:
Deubiquitinating enzyme 30 USP30 Ubiquitin carboxyl-terminal hydrolase 30 (USP30) Ubiquitin-specific-processing protease 30
Type:
Protein
Mol. Mass.:
58522.90
Organism:
Homo sapiens (Human)
Description:
Q70CQ3
Residue:
517
  
Inhibitor
Name:
BDBM447525
Synonyms:
(R)—N-(1-cyanopyrrolidin-3-yl)-3-(pyridin-4-yl)isoxazole-5-carboxamide US11053198, Example 64 | US11390584, Example 64
Type:
Small organic molecule
Emp. Form.:
C18H22N4O4
Mol. Mass.:
358.3917
SMILES:
CC(C)(C)OC(=O)N1CC[C@H](C1)NC(=O)c1cc(no1)-c1ccncc1
: