Target
Ubiquitin carboxyl-terminal hydrolase 30
Ligand
BDBM514235
Substrate
Meas. Tech.
USP30 Biochemical Fluorescence Intensity IC50 Assay
IC50
550±n/a nM
Citation
 Jones, AKemp, MStockley, MGibson, KWhitlock, G 1-cyano-pyrrolidine compounds as USP30 inhibitors US Patent  US11053198 Publication Date 7/6/2021 
Target
Name:
Ubiquitin carboxyl-terminal hydrolase 30
Synonyms:
Deubiquitinating enzyme 30 USP30 Ubiquitin carboxyl-terminal hydrolase 30 (USP30) Ubiquitin-specific-processing protease 30
Type:
Protein
Mol. Mass.:
58522.90
Organism:
Homo sapiens (Human)
Description:
Q70CQ3
Residue:
517
  
Inhibitor
Name:
BDBM514235
Synonyms:
(R)—N-(1-cyanopyrrolidin-3-yl)-5-phenylpyridazine-3-carboxamide | US11053198, Example 67
Type:
Small organic molecule
Emp. Form.:
C20H24N4O3
Mol. Mass.:
368.4296
SMILES:
CC(C)(C)OC(=O)N1CC[C@H](C1)NC(=O)c1cc(cnn1)-c1ccccc1
: