Target
Ubiquitin carboxyl-terminal hydrolase 30
Ligand
BDBM404538
Substrate
Meas. Tech.
USP30 Biochemical Fluorescence Intensity IC50 Assay
IC50
<100±n/a nM
Citation
 Jones, AKemp, MStockley, MGibson, KWhitlock, G 1-cyano-pyrrolidine compounds as USP30 inhibitors US Patent  US11053198 Publication Date 7/6/2021 
Target
Name:
Ubiquitin carboxyl-terminal hydrolase 30
Synonyms:
Deubiquitinating enzyme 30 USP30 Ubiquitin carboxyl-terminal hydrolase 30 (USP30) Ubiquitin-specific-processing protease 30
Type:
Protein
Mol. Mass.:
58522.90
Organism:
Homo sapiens (Human)
Description:
Q70CQ3
Residue:
517
  
Inhibitor
Name:
BDBM404538
Synonyms:
(R)-N-(1-cyanopyrrolidin-3-yl)-3-(4-methoxyphenyl)azetidine-1-carboxamide US10689345, Example 190 US11066365, Example 190 | US11390584, Example 190
Type:
Small organic molecule
Emp. Form.:
C16H20N4O2
Mol. Mass.:
300.3556
SMILES:
COc1ccc(cc1)C1CN(C1)C(=O)N[C@@H]1CCN(C1)C#N
: