Target
Ubiquitin carboxyl-terminal hydrolase 30
Ligand
BDBM404540
Substrate
Meas. Tech.
USP30 Biochemical Fluorescence Intensity IC50 Assay
IC50
<100±n/a nM
Citation
 Jones, AKemp, MStockley, MGibson, KWhitlock, G 1-cyano-pyrrolidine compounds as USP30 inhibitors US Patent  US11053198 Publication Date 7/6/2021 
Target
Name:
Ubiquitin carboxyl-terminal hydrolase 30
Synonyms:
Deubiquitinating enzyme 30 USP30 Ubiquitin carboxyl-terminal hydrolase 30 (USP30) Ubiquitin-specific-processing protease 30
Type:
Protein
Mol. Mass.:
58522.90
Organism:
Homo sapiens (Human)
Description:
Q70CQ3
Residue:
517
  
Inhibitor
Name:
BDBM404540
Synonyms:
(R)-3-(3-chlorophenyl)-N-(1-cyanopyrrolidin-3-yl)azetidine-1-carboxamide US10689345, Example 192 US11066365, Example 192 | US11390584, Example 192
Type:
Small organic molecule
Emp. Form.:
C15H17ClN4O
Mol. Mass.:
304.775
SMILES:
Clc1cccc(c1)C1CN(C1)C(=O)N[C@@H]1CCN(C1)C#N
: