Target
Ubiquitin carboxyl-terminal hydrolase 30
Ligand
BDBM404568
Substrate
Meas. Tech.
USP30 Biochemical Fluorescence Intensity IC50 Assay
IC50
<100±n/a nM
Citation
 Jones, AKemp, MStockley, MGibson, KWhitlock, G 1-cyano-pyrrolidine compounds as USP30 inhibitors US Patent  US11053198 Publication Date 7/6/2021 
Target
Name:
Ubiquitin carboxyl-terminal hydrolase 30
Synonyms:
Deubiquitinating enzyme 30 USP30 Ubiquitin carboxyl-terminal hydrolase 30 (USP30) Ubiquitin-specific-processing protease 30
Type:
Protein
Mol. Mass.:
58522.90
Organism:
Homo sapiens (Human)
Description:
Q70CQ3
Residue:
517
  
Inhibitor
Name:
BDBM404568
Synonyms:
(R)-N-(1-cyanopyrrolidin-3-yl)-3-(3, 4-dimethoxyphenyl)isoxazole-5-carboxamide US10689345, Example 220 US11066365, Example 220 | US11390584, Example 220
Type:
Small organic molecule
Emp. Form.:
C17H18N4O4
Mol. Mass.:
342.3492
SMILES:
COc1ccc(cc1OC)-c1cc(on1)C(=O)N[C@@H]1CCN(C1)C#N
: