Target
Ubiquitin carboxyl-terminal hydrolase 30
Ligand
BDBM404586
Substrate
Meas. Tech.
USP30 Biochemical Fluorescence Intensity IC50 Assay
IC50
<100±n/a nM
Citation
 Jones, AKemp, MStockley, MGibson, KWhitlock, G 1-cyano-pyrrolidine compounds as USP30 inhibitors US Patent  US11053198 Publication Date 7/6/2021 
Target
Name:
Ubiquitin carboxyl-terminal hydrolase 30
Synonyms:
Deubiquitinating enzyme 30 USP30 Ubiquitin carboxyl-terminal hydrolase 30 (USP30) Ubiquitin-specific-processing protease 30
Type:
Protein
Mol. Mass.:
58522.90
Organism:
Homo sapiens (Human)
Description:
Q70CQ3
Residue:
517
  
Inhibitor
Name:
BDBM404586
Synonyms:
(R)-3-(benzyloxy)-N-(1-cyanopyrrolidin-3-yl)-3-phenylazetidine-1-carboxamide US10689345, Example 238 US11066365, Example 238 | US11390584, Example 238
Type:
Small organic molecule
Emp. Form.:
C22H24N4O2
Mol. Mass.:
376.4516
SMILES:
O=C(N[C@@H]1CCN(C1)C#N)N1CC(C1)(OCc1ccccc1)c1ccccc1
: