Target
Cyclin-dependent kinase 4/G1/S-specific cyclin-D3
Ligand
BDBM515904
Substrate
Meas. Tech.
CDK Kinase Assays
IC50
2.00±n/a nM
Citation
 Wang, YWang, JDing, L Benzimidazole derivatives, preparation methods and uses thereof US Patent  US11053238 Publication Date 7/6/2021 
Target
Name:
Cyclin-dependent kinase 4/G1/S-specific cyclin-D3
Synonyms:
CDK4/Cyclin D3
Type:
Mol. Mass.:
Description:
ASSAY_ID of ChEMBL is 1806445
Components:
This complex has 2 components.
Component 1
Name:
Cyclin-dependent kinase 4
Synonyms:
CDK4 Cell division protein kinase 4 PSK-J3
Type:
Enzyme Subunit
Mol. Mass.:
33731.96
Organism:
Homo sapiens (Human)
Description:
P11802
Residue:
303
  
Component 2
Name:
G1/S-specific cyclin-D3
Synonyms:
CCND3 | CCND3_HUMAN
Type:
Enzyme
Mol. Mass.:
32521.90
Organism:
Homo sapiens (Human)
Description:
P30281
Residue:
292
  
Inhibitor
Name:
BDBM515904
Synonyms:
4-(6-fluoro-1- methyl-1,2,3,4- tetrahydrobenzo[4,5] imidazo[1,2-a] pyridin-8-yl)-N-(5-(4- methylpiperazin-1- yl)pyridin-2-yl) pyrimidin-2-amine | US11053238, Example 1
Type:
Small organic molecule
Emp. Form.:
C26H29FN8
Mol. Mass.:
472.5605
SMILES:
CC1CCCc2nc3c(F)cc(cc3n12)-c1ccnc(Nc2ccc(cn2)N2CCN(C)CC2)n1
: