Target
Cyclin-dependent kinase 4/G1/S-specific cyclin-D3
Ligand
BDBM516039
Substrate
Meas. Tech.
CDK Kinase Assays
IC50
1.90±n/a nM
Citation
 Wang, YWang, JDing, L Benzimidazole derivatives, preparation methods and uses thereof US Patent  US11053238 Publication Date 7/6/2021 
Target
Name:
Cyclin-dependent kinase 4/G1/S-specific cyclin-D3
Synonyms:
CDK4/Cyclin D3
Type:
Mol. Mass.:
Description:
ASSAY_ID of ChEMBL is 1806445
Components:
This complex has 2 components.
Component 1
Name:
Cyclin-dependent kinase 4
Synonyms:
CDK4 Cell division protein kinase 4 PSK-J3
Type:
Enzyme Subunit
Mol. Mass.:
33731.96
Organism:
Homo sapiens (Human)
Description:
P11802
Residue:
303
  
Component 2
Name:
G1/S-specific cyclin-D3
Synonyms:
CCND3 | CCND3_HUMAN
Type:
Enzyme
Mol. Mass.:
32521.90
Organism:
Homo sapiens (Human)
Description:
P30281
Residue:
292
  
Inhibitor
Name:
BDBM516039
Synonyms:
US11053238, Compound 2a | US11053238, Compound 2b
Type:
Small organic molecule
Emp. Form.:
C25H26F2N8
Mol. Mass.:
476.5243
SMILES:
CN1CCN(CC1)c1ccc(Nc2ncc(F)c(n2)-c2cc(F)c3nc4CCCCn4c3c2)nc1
: