Target
Toll-like receptor 7
Ligand
BDBM427875
Substrate
Meas. Tech.
TLR7/8/9 Inhibition Reporter Assays
IC50
0.310±n/a nM
Citation
 Dyckman, AJDodd, DSMussari, CPSherwood, TCWhiteley, BKGilmore, JLKumar, SRPasunoori, LSrinivas, PVDuraisamy, SKHegde, SAnumula, RK 4-azaindole compounds US Patent  US11053244 Publication Date 7/6/2021 
Target
Name:
Toll-like receptor 7
Synonyms:
ORF Names:UNQ248/PRO285 TLR7_HUMAN | Toll-like receptor 7 (TLR7)
Type:
Enzyme
Mol. Mass.:
120945.35
Organism:
Homo sapiens (Human)
Description:
Q9NYK1
Residue:
1049
  
Inhibitor
Name:
BDBM427875
Synonyms:
US10544143, Example 309 US10730877, Example 316 | US11053244, Example 316
Type:
Small organic molecule
Emp. Form.:
C27H34N6O2
Mol. Mass.:
474.5979
SMILES:
COc1cc(cn2ncnc12)-c1[nH]c2cc(C)c(nc2c1C(C)C)C1CCC(CC1)NC1COC1
: