Target
Toll-like receptor 7
Ligand
BDBM428081
Substrate
Meas. Tech.
TLR7/8/9 Inhibition Reporter Assays
IC50
0.220±n/a nM
Citation
 Dyckman, AJDodd, DSMussari, CPSherwood, TCWhiteley, BKGilmore, JLKumar, SRPasunoori, LSrinivas, PVDuraisamy, SKHegde, SAnumula, RK 4-azaindole compounds US Patent  US11053244 Publication Date 7/6/2021 
Target
Name:
Toll-like receptor 7
Synonyms:
ORF Names:UNQ248/PRO285 TLR7_HUMAN | Toll-like receptor 7 (TLR7)
Type:
Enzyme
Mol. Mass.:
120945.35
Organism:
Homo sapiens (Human)
Description:
Q9NYK1
Residue:
1049
  
Inhibitor
Name:
BDBM428081
Synonyms:
US10544143, Example 516 US11053244, Example 516
Type:
Small organic molecule
Emp. Form.:
C22H26N6
Mol. Mass.:
374.482
SMILES:
CC(C)c1c([nH]c2ccc(nc12)C1CCNCC1)-c1cc(C)c2ncnn2c1
: