Target
Toll-like receptor 8
Ligand
BDBM428552
Substrate
Meas. Tech.
TLR7/8/9 Inhibition Reporter Assays
IC50
0.230±n/a nM
Citation
 Dyckman, AJDodd, DSMussari, CPSherwood, TCWhiteley, BKGilmore, JLKumar, SRPasunoori, LSrinivas, PVDuraisamy, SKHegde, SAnumula, RK 4-azaindole compounds US Patent  US11053244 Publication Date 7/6/2021 
Target
Name:
Toll-like receptor 8
Synonyms:
CD_antigen: CD288 TLR8_HUMAN | TRL8
Type:
Enzyme
Mol. Mass.:
119828.77
Organism:
Homo sapiens (Human)
Description:
Q9NR97
Residue:
1041
  
Inhibitor
Name:
BDBM428552
Synonyms:
US10544143, Example 988 US11053244, Example 988
Type:
Small organic molecule
Emp. Form.:
C24H31N7
Mol. Mass.:
417.5498
SMILES:
CC[C@H]1CNCCN1c1ccc2[nH]c(c(C(C)C)c2n1)-c1cn2ncnc2c(C)c1C
: