Target
Bifunctional epoxide hydrolase 2
Ligand
BDBM408984
Substrate
Meas. Tech.
Assays for Epoxide Hydrolase Activity
Ki
0.770±0.02 nM
Citation
 Hammock, BDMorisseau, CYang, JHashimoto, K Methods of treating mental disorders US Patent  US11123311 Publication Date 9/21/2021 
Target
Name:
Bifunctional epoxide hydrolase 2
Synonyms:
Cytosolic epoxide hydrolase 2 EPHX2 HYES_HUMAN Soluble epoxide hydrolase (sEH) | epoxide hydrolase 2, cytoplasmic
Type:
Enzyme
Mol. Mass.:
62613.07
Organism:
Homo sapiens (Human)
Description:
P34913
Residue:
555
  
Inhibitor
Name:
BDBM408984
Synonyms:
US10377744, Compound No. 5 US11723929, Compound 5
Type:
Small organic molecule
Emp. Form.:
C18H20F3N3O4
Mol. Mass.:
399.3643
SMILES:
FC(F)(F)Oc1ccc(NC(=O)NC2CCN(CC2)C(=O)C2=COCC2)cc1
: