Target
Bifunctional epoxide hydrolase 2
Ligand
BDBM408994
Substrate
Meas. Tech.
Assays for Epoxide Hydrolase Activity
Ki
2.40±0.08 nM
Citation
 Hammock, BDMorisseau, CYang, JHashimoto, K Methods of treating mental disorders US Patent  US11123311 Publication Date 9/21/2021 
Target
Name:
Bifunctional epoxide hydrolase 2
Synonyms:
Cytosolic epoxide hydrolase 2 EPHX2 HYES_HUMAN Soluble epoxide hydrolase (sEH) | epoxide hydrolase 2, cytoplasmic
Type:
Enzyme
Mol. Mass.:
62613.07
Organism:
Homo sapiens (Human)
Description:
P34913
Residue:
555
  
Inhibitor
Name:
BDBM408994
Synonyms:
US10377744, Compound No. 15 US11723929, Compound 15
Type:
Small organic molecule
Emp. Form.:
C19H24F3N3O3
Mol. Mass.:
399.4074
SMILES:
FC(F)(F)c1ccc(NC(=O)NC2CCN(CC2)C(=O)C2CCCOC2)cc1
: