Target
Bifunctional epoxide hydrolase 2
Ligand
BDBM409015
Substrate
Meas. Tech.
Assays for Epoxide Hydrolase Activity
Ki
2.66±0.19 nM
Citation
 Hammock, BDMorisseau, CYang, JHashimoto, K Methods of treating mental disorders US Patent  US11123311 Publication Date 9/21/2021 
Target
Name:
Bifunctional epoxide hydrolase 2
Synonyms:
Cytosolic epoxide hydrolase 2 EPHX2 HYES_HUMAN Soluble epoxide hydrolase (sEH) | epoxide hydrolase 2, cytoplasmic
Type:
Enzyme
Mol. Mass.:
62613.07
Organism:
Homo sapiens (Human)
Description:
P34913
Residue:
555
  
Inhibitor
Name:
BDBM409015
Synonyms:
US10377744, Compound No. 35 US11723929, Compound 35
Type:
Small organic molecule
Emp. Form.:
C19H23F4N3O3
Mol. Mass.:
417.3978
SMILES:
Fc1cc(NC(=O)NC2CCN(CC2)C(=O)C2CCCOC2)ccc1C(F)(F)F
: