Target
Bifunctional epoxide hydrolase 2
Ligand
BDBM409020
Substrate
Meas. Tech.
Assays for Epoxide Hydrolase Activity
Ki
<0.050±n/a nM
Citation
 Hammock, BDMorisseau, CYang, JHashimoto, K Methods of treating mental disorders US Patent  US11123311 Publication Date 9/21/2021 
Target
Name:
Bifunctional epoxide hydrolase 2
Synonyms:
Cytosolic epoxide hydrolase 2 EPHX2 HYES_HUMAN Soluble epoxide hydrolase (sEH) | epoxide hydrolase 2, cytoplasmic
Type:
Enzyme
Mol. Mass.:
62613.07
Organism:
Homo sapiens (Human)
Description:
P34913
Residue:
555
  
Inhibitor
Name:
BDBM409020
Synonyms:
US10377744, Compound No. 40 US11723929, Compound 40
Type:
Small organic molecule
Emp. Form.:
C16H19F4N3O4
Mol. Mass.:
393.3334
SMILES:
CCOC(=O)N1CCC(CC1)NC(=O)Nc1ccc(OC(F)(F)F)c(F)c1
: