Target
Bifunctional epoxide hydrolase 2
Ligand
BDBM409023
Substrate
Meas. Tech.
Assays for Epoxide Hydrolase Activity
Ki
0.700±0.06 nM
Citation
 Hammock, BDMorisseau, CYang, JHashimoto, K Methods of treating mental disorders US Patent  US11123311 Publication Date 9/21/2021 
Target
Name:
Bifunctional epoxide hydrolase 2
Synonyms:
Cytosolic epoxide hydrolase 2 EPHX2 HYES_HUMAN Soluble epoxide hydrolase (sEH) | epoxide hydrolase 2, cytoplasmic
Type:
Enzyme
Mol. Mass.:
62613.07
Organism:
Homo sapiens (Human)
Description:
P34913
Residue:
555
  
Inhibitor
Name:
BDBM409023
Synonyms:
US10377744, Compound No. 43 US11723929, Compound 43
Type:
Small organic molecule
Emp. Form.:
C18H22F4N4O4
Mol. Mass.:
434.3853
SMILES:
Fc1cc(NC(=O)NC2CCN(CC2)C(=O)N2CCOCC2)ccc1OC(F)(F)F
: