Target
Tyrosine-protein kinase JAK1
Ligand
BDBM521949
Substrate
Meas. Tech.
Enzyme Assay
Ki
0.060±n/a nM
Citation
 Romero, FAZak, MZhao, GGibbons, PLi, WCheng, YYuen, PCheng, L Pyrazolopyrimidine compounds and methods of use thereof US Patent  US11155557 Publication Date 10/26/2021 
Target
Name:
Tyrosine-protein kinase JAK1
Synonyms:
JAK-1 JAK1A JAK1_HUMAN Janus kinase 1 (JAK1) | Janus kinase 1 JAK1
Type:
Protein
Mol. Mass.:
133293.73
Organism:
Homo sapiens (Human)
Description:
P23458
Residue:
1154
  
Inhibitor
Name:
BDBM521949
Synonyms:
N-[3-[6-(difluoromethoxy)-2- methyl-3-oxo-4H-1,4- benzothiazin-7-yl]-1H- pyrazol-4-yl]pyrazolo[1,5- a]pyrimidine-3-carboxamide US11155557, Example 95 | US11155557, Example 96
Type:
Small organic molecule
Emp. Form.:
C20H15F2N7O3S
Mol. Mass.:
471.44
SMILES:
CC1Sc2cc(-c3n[nH]cc3NC(=O)c3cnn4cccnc34)c(OC(F)F)cc2NC1=O
: