Target
Tyrosine-protein kinase JAK2
Ligand
BDBM522041
Substrate
Meas. Tech.
Enzyme Assay
Ki
0.080±n/a nM
Citation
 Romero, FAZak, MZhao, GGibbons, PLi, WCheng, YYuen, PCheng, L Pyrazolopyrimidine compounds and methods of use thereof US Patent  US11155557 Publication Date 10/26/2021 
Target
Name:
Tyrosine-protein kinase JAK2
Synonyms:
JAK-2 JAK2_HUMAN Janus kinase 2 (JAK2) | Janus kinase 2 (a protein tyrosine kinase)
Type:
Protein
Mol. Mass.:
130684.68
Organism:
Homo sapiens (Human)
Description:
O60674
Residue:
1132
  
Inhibitor
Name:
BDBM522041
Synonyms:
N-[3-[6-(difluoromethoxy)- 3,4-dihydro-2H-1,4- benzothiazin-7-yl]-1-[(1- methyltriazol-4- yl)methyl]pyrazol-4- yl]pyrazolo[1,5-a]pyrimidine- 3-carboxamide | US11155557, Example 131
Type:
Small organic molecule
Emp. Form.:
C23H20F2N10O2S
Mol. Mass.:
538.533
SMILES:
Cn1cc(Cn2cc(NC(=O)c3cnn4cccnc34)c(n2)-c2cc3SCCNc3cc2OC(F)F)nn1
: