Target
Interleukin-1 beta
Ligand
BDBM531254
Substrate
Meas. Tech.
IL-1 Secretion Assa
IC50
1.20±n/a nM
Citation
 Farady, CGommermann, NJanser, PMackay, AMattes, HSmith, NSolovay, CFStiefl, NJVangrevelinghe, EVelcicky, Jvon Matt, A NLRP3 inflammasome inhibitors US Patent  US11208399 Publication Date 12/28/2021 
Target
Name:
Interleukin-1 beta
Synonyms:
IL1B IL1F2 Interleukin-1 beta | hIL-1beta
Type:
Cytokine
Mol. Mass.:
30734.47
Organism:
Homo sapiens (Human)
Description:
P01584
Residue:
269
  
Inhibitor
Name:
BDBM531254
Synonyms:
US11208399, Example 13
Type:
Small organic molecule
Emp. Form.:
C20H25F3N4O2
Mol. Mass.:
410.4333
SMILES:
Cc1cc(nnc1N[C@@H]1CCCN(CCO)C1)-c1c(C)cc(cc1O)C(F)(F)F
: